FreshTomato-ARM compile error trying to make ea6700z target

Discussion in 'General Discussion' started by harrison, May 6, 2018.

  1. harrison

    harrison New Member Member

    When attempting to compile the image for ea6700z using kille72's tutorial, I receive an error regarding mysql - shown below. I am compiling on Debian 9.4-ARM VM. Anyone have similar issues and/or any solutions?

    Code:
    mysql/stamp-h1 
    find patches/mysql -maxdepth 1 -type f -name '*.patch' | sort -t '\0' -n | while read FILE; do ( if ! patch -p0 -Rf --dry-run --silent < $FILE 2>/dev/null; then patch -p0 < $FILE; fi ) done
    4 out of 5 hunks FAILED
    patching file mysql/configure
    Hunk #1 FAILED at 26300.
    Hunk #2 FAILED at 26393.
    Hunk #3 FAILED at 48118.
    Hunk #4 FAILED at 48224.
    Hunk #5 FAILED at 48437.
    5 out of 5 hunks FAILED -- saving rejects to file mysql/configure.rej
    Makefile:2088: recipe for target 'mysql/stamp-h1' failed
    make[4]: *** [mysql/stamp-h1] Error 1
    make[4]: Leaving directory '/home/harrison/kille72/release/src-rt-6.x.4708/router'
    Makefile:123: recipe for target 'all' failed
    make[3]: *** [all] Error 2
    make[3]: Leaving directory '/home/harrison/kille72/release/src-rt-6.x.4708'
    Makefile:974: recipe for target 'bin' failed
    make[2]: *** [bin] Error 2
    make[2]: Leaving directory '/home/harrison/kille72/release/src-rt-6.x.4708'
    Makefile:993: recipe for target 'z' failed
    make[1]: *** [z] Error 2
    make[1]: Leaving directory '/home/harrison/kille72/release/src-rt-6.x.4708'
    Makefile:1053: recipe for target 'ea6700z' failed
    make: *** [ea6700z] Error 2
    
     
    Last edited: May 7, 2018
  1. This site uses cookies to help personalise content, tailor your experience and to keep you logged in if you register.
    By continuing to use this site, you are consenting to our use of cookies.
    Dismiss Notice